BDBM50034307 CHEMBL23912::N-{4-[4-(2-Methoxy-phenyl)-piperazin-1-yl]-butyl}-nicotinamide
SMILES COc1ccccc1N1CCN(CCCCNC(=O)c2cccnc2)CC1
InChI Key InChIKey=AHHOKEBBUZLGDG-UHFFFAOYSA-N
Data  1 KI
  Tab Delimited (TSV)   2D SDfile   Computed 3D by Vconf -m prep SDfile
Find this compound or compounds like it in BindingDB:
Activity Spreadsheet -- Enzyme Inhibition Constant Data from BindingDB
Found 1 hit for monomerid = 50034307
Target5-hydroxytryptamine receptor 1A(Rattus norvegicus (rat))
Faes
Curated by ChEMBL
LigandPNGBDBM50034307(CHEMBL23912 | N-{4-[4-(2-Methoxy-phenyl)-piperazin...)
Affinity DataKi:  25.2nM. Assay description: In vitro ability to displace [3H]-8-OH-DPAT from 5-hydroxytryptamine 1A receptor sites of rat brain cortex.
In DepthDetails ArticlePubMed