BDBM50035516 4-Amino-3-iodo-N-{2-[4-(2-methoxy-phenyl)-piperazin-1-yl]-ethyl}-N-pyridin-2-yl-benzamide::CHEMBL140564
SMILES COc1ccccc1N1CCN(CCN(C(=O)c2ccc(N)c(I)c2)c2ccccn2)CC1
InChI Key InChIKey=VYDQZPNGCJJVEQ-UHFFFAOYSA-N
Data  1 KI
  Tab Delimited (TSV)   2D SDfile   Computed 3D by Vconf -m prep SDfile
Find this compound or compounds like it in BindingDB:
Activity Spreadsheet -- Enzyme Inhibition Constant Data from BindingDB
Found 1 hit for monomerid = 50035516
Target5-hydroxytryptamine receptor 1A(Rattus norvegicus (rat))
University Of Pennsylvania
Curated by ChEMBL
LigandPNGBDBM50035516(4-Amino-3-iodo-N-{2-[4-(2-methoxy-phenyl)-piperazi...)
Affinity DataKi:  18nM. Assay description: In vitro binding affinity to 5-hydroxytryptamine 1A receptor in rat hippocampal homogenate by [125I](R)-(+)-trans-8-OH-PIPAT displacement.
In DepthDetails ArticlePubMed