BDBM50036578 CHEMBL3354246
SMILES [H][C@@]1(C[C@@]2(CCC3CCCCC3)NC(=N)N(C)C2=O)CCN(C1)C(=O)CCCC
InChI Key InChIKey=MNXDSLVDLSSUGR-PGRDOPGGSA-N
Data  1 KI
  Tab Delimited (TSV)   2D SDfile   Computed 3D by Vconf -m prep SDfile
Find this compound or compounds like it in BindingDB:
Activity Spreadsheet -- Enzyme Inhibition Constant Data from BindingDB
Found 1 hit for monomerid = 50036578
TargetBeta-secretase 1(Homo sapiens (Human))
Merck Research Laboratories
Curated by ChEMBL
LigandPNGBDBM50036578(CHEMBL3354246)
Affinity DataKi:  1.74E+4nM. Assay description: Inhibition of purified human BACE1 by FRET assay
In DepthDetails ArticlePubMed