BDBM50036591 CHEMBL3354242
SMILES [H][C@@]1(C[C@@]2(CCC3CCCCC3)NC(=N)N(C)C2=O)CCCN(C1)C(=O)CCCC
InChI Key InChIKey=WHBVQJZRIGLEOT-WMZHIEFXSA-N
Data  2 KI
  Tab Delimited (TSV)   2D SDfile   Computed 3D by Vconf -m prep SDfile
Find this compound or compounds like it in BindingDB:
Activity Spreadsheet -- Enzyme Inhibition Constant Data from BindingDB
Found 2 hits for monomerid = 50036591
TargetBeta-secretase 1(Homo sapiens (Human))
Merck Research Laboratories
Curated by ChEMBL
LigandPNGBDBM50036591(CHEMBL3354242)
Affinity DataKi:  1.70E+4nM. Assay description: Inhibition of purified human BACE1 by FRET assay
In DepthDetails ArticlePubMed
TargetCathepsin D(Homo sapiens (Human))
Merck Research Laboratories
Curated by ChEMBL
LigandPNGBDBM50036591(CHEMBL3354242)
Affinity DataKi:  2.80E+4nM. Assay description: Inhibition of cathepsin-D (unknown origin)
In DepthDetails ArticlePubMed