BDBM50036922 2-[4-(4-Benzo[d]isothiazol-3-yl-piperazin-1-yl)-butyl]-2,3-dihydro-isoindol-1-one::CHEMBL41626
SMILES O=C1N(CCCCN2CCN(CC2)c2nsc3ccccc23)Cc2ccccc12
InChI Key InChIKey=ZPAUMFOJNAADJN-UHFFFAOYSA-N
Data  4 IC50
  Tab Delimited (TSV)   2D SDfile   Computed 3D by Vconf -m prep SDfile
Find this compound or compounds like it in BindingDB:
Activity Spreadsheet -- Enzyme Inhibition Constant Data from BindingDB
Found 4 hits for monomerid = 50036922
TargetD(2) dopamine receptor(Rattus norvegicus (rat))
Burroughs Wellcome
Curated by ChEMBL
LigandPNGBDBM50036922(2-[4-(4-Benzo[d]isothiazol-3-yl-piperazin-1-yl)-bu...)
Affinity DataIC50:  43nM. Assay description: In vitro binding affinity was measured by displacement of [3H]- raclopride from D2 receptor isolated from the striata of male Dawley rats
In DepthDetails ArticlePubMed
Target5-hydroxytryptamine receptor 1A(Rattus norvegicus (rat))
Glaxo Wellcome
Curated by ChEMBL
LigandPNGBDBM50036922(2-[4-(4-Benzo[d]isothiazol-3-yl-piperazin-1-yl)-bu...)
Affinity DataIC50:  7nM. Assay description: Inhibition of [3H]-8-OH-DPAT binding at serotonin 5-hydroxytryptamine 1A receptor from rat hippocampus tissue.
In DepthDetails ArticlePubMed
TargetD(2) dopamine receptor(Rattus norvegicus (rat))
Burroughs Wellcome
Curated by ChEMBL
LigandPNGBDBM50036922(2-[4-(4-Benzo[d]isothiazol-3-yl-piperazin-1-yl)-bu...)
Affinity DataIC50:  43nM. Assay description: Inhibition of [3H]-raclopride binding at Dopamine receptor D2 from rat striata.
In DepthDetails ArticlePubMed
Target5-hydroxytryptamine receptor 1A(Rattus norvegicus (rat))
Glaxo Wellcome
Curated by ChEMBL
LigandPNGBDBM50036922(2-[4-(4-Benzo[d]isothiazol-3-yl-piperazin-1-yl)-bu...)
Affinity DataIC50:  7nM. Assay description: In vitro binding affinity was measured on serotonergic 5-hydroxytryptamine 1A receptor by displacement of [3H]- tetralin
In DepthDetails ArticlePubMed