BDBM50037115 2-(3-Acetylamino-2-oxo-2H-pyridin-1-yl)-N-(3,3,3-trifluoro-1-isopropyl-2-oxo-propyl)-acetamide::CHEMBL25490
SMILES CC(C)C(NC(=O)Cn1cccc(NC(C)=O)c1=O)C(=O)C(F)(F)F
InChI Key InChIKey=QIOIVBRPECJGDP-UHFFFAOYSA-N
Data  3 KI
  Tab Delimited (TSV)   2D SDfile   Computed 3D by Vconf -m prep SDfile
Find this compound or compounds like it in BindingDB:
Activity Spreadsheet -- Enzyme Inhibition Constant Data from BindingDB
Found 3 hits for monomerid = 50037115
TargetNeutrophil elastase(Homo sapiens (Human))
Zeneca Pharmaceuticals Group
Curated by ChEMBL
LigandPNGBDBM50037115(2-(3-Acetylamino-2-oxo-2H-pyridin-1-yl)-N-(3,3,3-t...)
Affinity DataKi:  2.80E+3nM. Assay description: Inhibition of Human Leukocyte Elastase (HLE)
In DepthDetails ArticlePubMed
TargetNeutrophil elastase(Homo sapiens (Human))
Zeneca Pharmaceuticals Group
Curated by ChEMBL
LigandPNGBDBM50037115(2-(3-Acetylamino-2-oxo-2H-pyridin-1-yl)-N-(3,3,3-t...)
Affinity DataKi:  2.80E+3nM. Assay description: Inhibition of human leukocyte elastase
In DepthDetails PubMed
TargetNeutrophil elastase(Homo sapiens (Human))
Zeneca Pharmaceuticals Group
Curated by ChEMBL
LigandPNGBDBM50037115(2-(3-Acetylamino-2-oxo-2H-pyridin-1-yl)-N-(3,3,3-t...)
Affinity DataKi:  2.80E+3nM. Assay description: The compound was tested in vitro for ability to inhibit human leukocyte elastase activity
In DepthDetails ArticlePubMed