BDBM50037182 2-[4-(Benzyl-methyl-amino)-butyl]-5-nitro-isoindole-1,3-dione::CHEMBL106678
SMILES CN(CCCCN1C(=O)c2ccc(cc2C1=O)[N+]([O-])=O)Cc1ccccc1
InChI Key InChIKey=NSBSWSACUXFVFK-UHFFFAOYSA-N
Data  1 IC50
  Tab Delimited (TSV)   2D SDfile   Computed 3D by Vconf -m prep SDfile
Find this compound or compounds like it in BindingDB:
Activity Spreadsheet -- Enzyme Inhibition Constant Data from BindingDB
Found 1 hit for monomerid = 50037182
TargetAcetylcholinesterase(Rattus norvegicus (rat))
Takeda Chemical Industries
Curated by ChEMBL
LigandPNGBDBM50037182(2-[4-(Benzyl-methyl-amino)-butyl]-5-nitro-isoindol...)
Affinity DataIC50:  8.23E+3nM. Assay description: Inhibition concentration against rat acetylcholinesterase
In DepthDetails ArticlePubMed