BDBM50037320 (R)-4-((R)-1-Carboxy-2-hydroxy-ethylcarbamoyl)-2-{4-[(2-methyl-4-oxo-3,4-dihydro-quinazolin-6-ylmethyl)-prop-2-ynyl-amino]-benzoylamino}-butyric acid::CHEMBL113601
SMILES Cc1nc2ccc(CN(CC#C)c3ccc(cc3)C(=O)N[C@H](CCC(=O)N[C@H](CO)C(O)=O)C(O)=O)cc2c(=O)[nH]1
InChI Key InChIKey=SVPYJDQPEVFXSB-DHIUTWEWSA-N
Data  1 IC50
  Tab Delimited (TSV)   2D SDfile   Computed 3D by Vconf -m prep SDfile
Find this compound or compounds like it in BindingDB:
Activity Spreadsheet -- Enzyme Inhibition Constant Data from BindingDB
Found 1 hit for monomerid = 50037320
TargetThymidylate synthase(Mus musculus)
Institute Of Cancer Research
Curated by ChEMBL
LigandPNGBDBM50037320((R)-4-((R)-1-Carboxy-2-hydroxy-ethylcarbamoyl)-2-{...)
Affinity DataIC50:  22nM. Assay description: Tested for inhibition against thymidylate synthase(TS) which is partially purified from L1210 mouse leukemia cells
In DepthDetails ArticlePubMed