BDBM50037336 CHEMBL432961::{6-(2-Chloro-phenyl)-2-oxo-1-[(3,3,3-trifluoro-1-isopropyl-2-oxo-propylcarbamoyl)-methyl]-1,2-dihydro-pyridin-3-yl}-carbamic acid benzyl ester
SMILES CC(C)C(NC(=O)Cn1c(ccc(NC(=O)OCc2ccccc2)c1=O)-c1ccccc1Cl)C(=O)C(F)(F)F
InChI Key InChIKey=QUSDITZWJZYKIX-UHFFFAOYSA-N
Data  1 KI
  Tab Delimited (TSV)   2D SDfile   Computed 3D by Vconf -m prep SDfile
Find this compound or compounds like it in BindingDB:
Activity Spreadsheet -- Enzyme Inhibition Constant Data from BindingDB
Found 1 hit for monomerid = 50037336
TargetNeutrophil elastase(Homo sapiens (Human))
Zeneca Pharmaceuticals Group
Curated by ChEMBL
LigandPNGBDBM50037336(CHEMBL432961 | {6-(2-Chloro-phenyl)-2-oxo-1-[(3,3,...)
Affinity DataKi:  11nM. Assay description: Tested for inhibitory activity against human leukocyte elastase(HLE) enzyme
In DepthDetails ArticlePubMed