BDBM50037530 (S)-4-(4-Bromo-2-mercapto-benzyl)-1-[(2S,4R)-2-hydroxy-4-((R)-(R)-2-hydroxy-indan-1-ylcarbamoyl)-5-phenyl-pentyl]-piperazine-2-carboxylic acid tert-butylamide::CHEMBL326600
SMILES CC(C)(C)NC(=O)[C@@H]1CN(Cc2ccc(Br)cc2S)CCN1C[C@@H](O)C[C@@H](Cc1ccccc1)C(=O)NC1[C@H](O)Cc2ccccc12
InChI Key InChIKey=FWDLLMHEAFMLAW-JRFXPVKESA-N
Data  1 IC50
  Tab Delimited (TSV)   2D SDfile   Computed 3D by Vconf -m prep SDfile
Find this compound or compounds like it in BindingDB:
Activity Spreadsheet -- Enzyme Inhibition Constant Data from BindingDB
Found 1 hit for monomerid = 50037530
TargetGag-Pol polyprotein [489-587](Human immunodeficiency virus type 1)
Merck Research Laboratories
Curated by ChEMBL
LigandPNGBDBM50037530((S)-4-(4-Bromo-2-mercapto-benzyl)-1-[(2S,4R)-2-hyd...)
Affinity DataIC50:  0.0600nM. Assay description: Evaluated for the inhibition of HIV protease
In DepthDetails ArticlePubMed