BDBM50038854 2-(4-methoxybenzyl)-1H,2'H,5'H-spiro[isoquinoline-4,3'-pyrrolidine]-1,2',3,5'(2H)-tetrone::CHEMBL294587
SMILES COc1ccc(CN2C(=O)c3ccccc3C3(CC(=O)NC3=O)C2=O)cc1
InChI Key InChIKey=CXXXIENTZYURJX-UHFFFAOYSA-N
Data  1 IC50
  Tab Delimited (TSV)   2D SDfile   Computed 3D by Vconf -m prep SDfile
Find this compound or compounds like it in BindingDB:
Activity Spreadsheet -- Enzyme Inhibition Constant Data from BindingDB
Found 1 hit for monomerid = 50038854
TargetAldo-keto reductase family 1 member B1 [K65Q](Bos taurus (Cattle))
Wyeth-Ayerst Research
Curated by ChEMBL
LigandPNGBDBM50038854(2-(4-methoxybenzyl)-1H,2'H,5'H-spiro[isoquinoline-...)
Affinity DataIC50:  25nM. Assay description: In vitro inhibition of aldose reductase activity in a partially purified bovine lens preparationChecked by Author
In DepthDetails ArticlePubMed