BDBM50038954 CHEMBL67854::{2-[(R)-3-Phenyl-2-(4-sulfamoyl-benzoylamino)-propionylamino]-acetylamino}-acetic acid benzyl ester
SMILES NS(=O)(=O)c1ccc(cc1)C(=O)N[C@H](Cc1ccccc1)C(=O)NCC(=O)NCC(=O)OCc1ccccc1
InChI Key InChIKey=CHHNNYZEIZYCCY-HSZRJFAPSA-N
Data  1 Kd
  Tab Delimited (TSV)   2D SDfile   Computed 3D by Vconf -m prep SDfile
Find this compound or compounds like it in BindingDB:
Activity Spreadsheet -- Enzyme Inhibition Constant Data from BindingDB
Found 1 hit for monomerid = 50038954
TargetCarbonic anhydrase 2(Homo sapiens (Human))
Harvard University
Curated by ChEMBL
LigandPNGBDBM50038954(CHEMBL67854 | {2-[(R)-3-Phenyl-2-(4-sulfamoyl-benz...)
Affinity DataKd:  36nM. Assay description: Dissociation constant against human Carbonic anhydrase II (HCA II)
In DepthDetails ArticlePubMed