BDBM50038980 Benzo[1,3]dioxol-5-ylmethyl-[1,3]dioxolo[4,5-g]quinazolin-8-yl-amine::CHEMBL63416
SMILES C(Nc1ncnc2cc3OCOc3cc12)c1ccc2OCOc2c1
InChI Key InChIKey=FKQAXLINOJNNLE-UHFFFAOYSA-N
Data  1 IC50
  Tab Delimited (TSV)   2D SDfile   Computed 3D by Vconf -m prep SDfile
Find this compound or compounds like it in BindingDB:
Activity Spreadsheet -- Enzyme Inhibition Constant Data from BindingDB
Found 1 hit for monomerid = 50038980
TargetcGMP-specific 3',5'-cyclic phosphodiesterase(Homo sapiens (Human))
Eisai
Curated by ChEMBL
LigandPNGBDBM50038980(Benzo[1,3]dioxol-5-ylmethyl-[1,3]dioxolo[4,5-g]qui...)
Affinity DataIC50:  1.60E+3nM. Assay description: Inhibitory activity against cGMP-phosphodiesterase from porcine aorta
In DepthDetails ArticlePubMed