BDBM50039563 (R)-N*1*-[(1S,2R)-1-Benzyl-3-((3S,4aS,8aS)-3-tert-butylcarbamoyl-octahydro-isoquinolin-2-yl)-2-hydroxy-propyl]-2-[(quinoline-2-carbonyl)-amino]-succinamide::CHEMBL83506
SMILES CC(C)(C)NC(=O)[C@@H]1C[C@@H]2CCCC[C@@H]2CN1C[C@@H](O)[C@H](Cc1ccccc1)NC(=O)[C@@H](CC(N)=O)NC(=O)c1ccc2ccccc2n1
InChI Key InChIKey=QWAXKHKRTORLEM-NSVAWXKESA-N
Data  1 IC50
  Tab Delimited (TSV)   2D SDfile   Computed 3D by Vconf -m prep SDfile
Find this compound or compounds like it in BindingDB:
Activity Spreadsheet -- Enzyme Inhibition Constant Data from BindingDB
Found 1 hit for monomerid = 50039563
TargetGag-Pol polyprotein [489-587](Human immunodeficiency virus type 1)
Merck Research Laboratories
Curated by ChEMBL
LigandPNGBDBM50039563((R)-N*1*-[(1S,2R)-1-Benzyl-3-((3S,4aS,8aS)-3-tert-...)
Affinity DataIC50:  0.230nM. Assay description: Tested for inhibitory activity against HIV protease enzyme
In DepthDetails ArticlePubMed