BDBM50039608 1-(2-iodobenzyl)-3-spiro[1,2,3,4-tetrahydronaphthalene-1,4'-(hexahydropyridine)]-1-yl-(3R,4R)-hexahydro-4-pyridinol::CHEMBL84738
SMILES O[C@@H]1CCN(Cc2ccccc2I)C[C@H]1N1CCC2(CCCc3ccccc23)CC1
InChI Key InChIKey=WVSGZIOZPOCDOF-JWQCQUIFSA-N
Data  1 KI
  Tab Delimited (TSV)   2D SDfile   Computed 3D by Vconf -m prep SDfile
Find this compound or compounds like it in BindingDB:
Activity Spreadsheet -- Enzyme Inhibition Constant Data from BindingDB
Found 1 hit for monomerid = 50039608
TargetVesicular acetylcholine transporter(Torpedo californica)
University Of Minnesota
Curated by ChEMBL
LigandPNGBDBM50039608(1-(2-iodobenzyl)-3-spiro[1,2,3,4-tetrahydronaphtha...)
Affinity DataKi:  5.80nM. Assay description: In vitro binding affinity to vesamicol receptor using [3H]-vesamicol.
In DepthDetails ArticlePubMed