BDBM50040068 4-Chloro-benzene-1,3-disulfonic acid 3-amide 1-({2-[2-hydroxy-3-(naphthalen-1-yloxy)-propylamino]-ethyl}-amide)::CHEMBL43196
SMILES NS(=O)(=O)c1cc(ccc1Cl)S(=O)(=O)NCCNCC(O)COc1cccc2ccccc12
InChI Key InChIKey=JRLBCEKFJIVBLT-UHFFFAOYSA-N
Data  1 KI
  Tab Delimited (TSV)   2D SDfile   Computed 3D by Vconf -m prep SDfile
Find this compound or compounds like it in BindingDB:
Activity Spreadsheet -- Enzyme Inhibition Constant Data from BindingDB
Found 1 hit for monomerid = 50040068
TargetBeta-1 adrenergic receptor(Homo sapiens (Human))
Università
Curated by ChEMBL
LigandPNGBDBM50040068(4-Chloro-benzene-1,3-disulfonic acid 3-amide 1-({2...)
Affinity DataKi:  160nM. Assay description: Inhibition of [3H]-Dihydroalprenolol binding to beta 1 adrenoceptor from turkey erythrocyte membranes.
In DepthDetails ArticlePubMed