BDBM50040133 CHEMBL444626::Tyr-Gly-Gly-Phe-c(Cys-Arg-Arg-Ile-Arg-Cys)-lys
SMILES CC[C@H](C)[C@@H]1NC(=O)[C@@H](CCCNC(N)=N)NC(=O)[C@H](CCCNC(N)=N)NC(=O)[C@@H](CSSC[C@@H](NC(=O)[C@@H](CCCNC(N)=N)NC1=O)C(=O)N[C@@H](CCCCN)C(O)=O)NC(=O)[C@H](Cc1ccccc1)NC(=O)CNC(=O)CNC(=O)[C@@H](N)Cc1ccc(O)cc1
InChI Key InChIKey=HCAKSCQUNWRYRV-GCOXHJDASA-N
Data  5 IC50
  Tab Delimited (TSV)   2D SDfile   Computed 3D by Vconf -m prep SDfile
Find this compound or compounds like it in BindingDB:
Activity Spreadsheet -- Enzyme Inhibition Constant Data from BindingDB
Found 5 hits for monomerid = 50040133
TargetMu-type opioid receptor(GUINEA PIG)
University Of Arizona
Curated by ChEMBL
LigandPNGBDBM50040133(CHEMBL444626 | Tyr-Gly-Gly-Phe-c(Cys-Arg-Arg-Ile-A...)
Affinity DataIC50:  4.30nM. Assay description: Inhibition of [3H]-PL-17 binding to mu opioid receptor of guinea pig brain homogenate
In DepthDetails ArticlePubMed
TargetDelta-type opioid receptor(Homo sapiens (Human))
University Of Arizona
Curated by ChEMBL
LigandPNGBDBM50040133(CHEMBL444626 | Tyr-Gly-Gly-Phe-c(Cys-Arg-Arg-Ile-A...)
Affinity DataIC50:  83nM. Assay description: Inhibition of [3H]-DPDPE binding to delta opioid receptor of guinea pig brain homogenate
In DepthDetails ArticlePubMed
TargetDelta-type opioid receptor(MOUSE)
University Of Arizona
Curated by ChEMBL
LigandPNGBDBM50040133(CHEMBL444626 | Tyr-Gly-Gly-Phe-c(Cys-Arg-Arg-Ile-A...)
Affinity DataIC50: >3.00E+3nM. Assay description: Inhibition of delta-selective antagonist binding to opioid receptor of mouse vas dferens
In DepthDetails ArticlePubMed
TargetKappa-type opioid receptor(Cavia porcellus (domestic guinea pig))
University Of Arizona
Curated by ChEMBL
LigandPNGBDBM50040133(CHEMBL444626 | Tyr-Gly-Gly-Phe-c(Cys-Arg-Arg-Ile-A...)
Affinity DataIC50:  0.593nM. Assay description: Inhibition of [3H]-U-69,593 binding to kappa opoid receptor of guinea pig brain homogenate
In DepthDetails ArticlePubMed
TargetMu-type opioid receptor(GUINEA PIG)
University Of Arizona
Curated by ChEMBL
LigandPNGBDBM50040133(CHEMBL444626 | Tyr-Gly-Gly-Phe-c(Cys-Arg-Arg-Ile-A...)
Affinity DataIC50:  286nM. Assay description: Inhibition of mu-selective antagonist binding to opioid receptor of guinea pig ileum
In DepthDetails ArticlePubMed