BDBM50040572 (E)-4-[4-(4-Chloro-phenyl)-4-hydroxy-1-oxy-piperidin-1-yl]-1-(4-fluoro-phenyl)-but-2-en-1-one::CHEMBL160413
SMILES OC1(CC[N+]([O-])(CC=CC(=O)c2ccc(F)cc2)CC1)c1ccc(Cl)cc1
InChI Key InChIKey=ZXAWVXQHJXOCPD-UHFFFAOYSA-N
Data  2 IC50
  Tab Delimited (TSV)   2D SDfile   Computed 3D by Vconf -m prep SDfile
Find this compound or compounds like it in BindingDB:
Activity Spreadsheet -- Enzyme Inhibition Constant Data from BindingDB
Found 2 hits for monomerid = 50040572
TargetGag-Pol polyprotein [489-587](Human immunodeficiency virus type 1)
University Of California
Curated by ChEMBL
LigandPNGBDBM50040572((E)-4-[4-(4-Chloro-phenyl)-4-hydroxy-1-oxy-piperid...)
Affinity DataIC50:  3.00E+4nM. Assay description: In vitro inhibition of recombinant HIV-1 protease expressed in E. coli strain D1210
In DepthDetails ArticlePubMed
TargetGenome polyprotein(Human rhinovirus B)
University Of California
Curated by ChEMBL
LigandPNGBDBM50040572((E)-4-[4-(4-Chloro-phenyl)-4-hydroxy-1-oxy-piperid...)
Affinity DataIC50:  4.00E+4nM. Assay description: In vitro inhibition of recombinant HIV-2 protease expressed in E. coli strain X90
In DepthDetails ArticlePubMed