BDBM50040726 CHEMBL1236126
SMILES CC(C)(C)C(=O)Oc1ccc2n(CCCO)c(NC(=O)c3cccc(c3)[N+]([O-])=O)nc2c1
InChI Key InChIKey=CEAYRKIZESVQSN-UHFFFAOYSA-N
Data  1 KI
PDB links: 1 PDB ID matches this monomer.
  Tab Delimited (TSV)   2D SDfile   Computed 3D by Vconf -m prep SDfile
Find this compound or compounds like it in BindingDB:
Activity Spreadsheet -- Enzyme Inhibition Constant Data from BindingDB
Found 1 hit for monomerid = 50040726
TargetInterleukin-1 receptor-associated kinase 4(Homo sapiens (Human))
Nimbus Discovery
Curated by ChEMBL
LigandPNGBDBM50040726(CHEMBL1236126)
Affinity DataKi:  1.20nM. Assay description: Inhibition of IRAK4 (unknown origin)