BDBM50040860 (S)-2-({5-[(3-Methyl-1-oxo-1,2-dihydro-benzo[f]quinazolin-9-ylmethyl)-amino]-thiophene-2-carbonyl}-amino)-pentanedioic acid::CHEMBL169506
SMILES Cc1nc2ccc3ccc(CNc4ccc(s4)C(=O)N[C@@H](CCC(O)=O)C(O)=O)cc3c2c(=O)[nH]1
InChI Key InChIKey=HUVYGVTXIYXRCU-KRWDZBQOSA-N
Data  1 KI
  Tab Delimited (TSV)   2D SDfile   Computed 3D by Vconf -m prep SDfile
Find this compound or compounds like it in BindingDB:
Activity Spreadsheet -- Enzyme Inhibition Constant Data from BindingDB
Found 1 hit for monomerid = 50040860
TargetThymidylate synthase(Homo sapiens (Human))
Wellcome Research Laboratories
Curated by ChEMBL
LigandPNGBDBM50040860((S)-2-({5-[(3-Methyl-1-oxo-1,2-dihydro-benzo[f]qui...)
Affinity DataKi:  1.10nM. Assay description: The compound was tested for inhibitory activity against thymidylate synthase(purified recombinant human gene) from E. coli
In DepthDetails ArticlePubMed