BDBM50041365 (R)-6-Butyl-10,13-dimethyl-1,6,7,8,9,10,11,12,13,14,15,16-dodecahydro-2H-cyclopenta[a]phenanthrene-3,17-dione::CHEMBL24037
SMILES CCCC[C@@H]1CC2C3CCC(=O)C3(C)CCC2C2(C)CCC(=O)C=C12
InChI Key InChIKey=UYOQAIUOBLCZNG-CQPDLKSQSA-N
Data  1 KI  1 IC50
  Tab Delimited (TSV)   2D SDfile   Computed 3D by Vconf -m prep SDfile
Find this compound or compounds like it in BindingDB:
Activity Spreadsheet -- Enzyme Inhibition Constant Data from BindingDB
Found 2 hits for monomerid = 50041365
TargetAromatase(Homo sapiens (Human))
Tohoku College Of Pharmacy
Curated by ChEMBL
LigandPNGBDBM50041365((R)-6-Butyl-10,13-dimethyl-1,6,7,8,9,10,11,12,13,1...)
Affinity DataKi:  8.80nM. Assay description: Binding affinity for human placental microsome Cytochrome P450 19A1
In DepthDetails ArticlePubMed
TargetAromatase(Homo sapiens (Human))
Tohoku College Of Pharmacy
Curated by ChEMBL
LigandPNGBDBM50041365((R)-6-Butyl-10,13-dimethyl-1,6,7,8,9,10,11,12,13,1...)
Affinity DataIC50:  510nM. Assay description: Inhibitory concentration was tested on Cytochrome P450 19A1 in human placental microsomes 20 (microg) of protein incubated for 20 min
In DepthDetails ArticlePubMed