BDBM50041649 CHEMBL287712::[1-[(S)-1-({[(1-Carbamoyl-2-phenyl-ethyl)-methyl-carbamoyl]-methyl}-carbamoyl)-5-(3-o-tolyl-ureido)-pentylcarbamoyl]-2-(1H-indol-3-yl)-ethyl]-carbamic acid tert-butyl ester
SMILES CN(C(Cc1ccccc1)C(N)=O)C(=O)CNC(=O)[C@H](CCCCNC(=O)Nc1ccccc1C)NC(=O)C(Cc1c[nH]c2ccccc12)NC(=O)OC(C)(C)C
InChI Key InChIKey=SSHHMZGLDXLYQH-APULKCGVSA-N
Data  1 IC50
  Tab Delimited (TSV)   2D SDfile   Computed 3D by Vconf -m prep SDfile
Find this compound or compounds like it in BindingDB:
Activity Spreadsheet -- Enzyme Inhibition Constant Data from BindingDB
Found 1 hit for monomerid = 50041649
TargetCholecystokinin receptor type A(Cavia porcellus)
Abbott Laboratories
Curated by ChEMBL
LigandPNGBDBM50041649(CHEMBL287712 | [1-[(S)-1-({[(1-Carbamoyl-2-phenyl-...)
Affinity DataIC50:  141nM. Assay description: Concentration that inhibited 50% of specific binding of [125I]-Bolton-Hunter CCK-8 binding in guinea pig pancreas
In DepthDetails ArticlePubMed