BDBM50042023 CHEMBL3360129
SMILES Cn1c(nc(C(=O)NCc2ccc(F)cc2S(C)(=O)=O)c(O)c1=O)C1CCOCC1
InChI Key InChIKey=GNPUYPCSSXYVNR-UHFFFAOYSA-N
Data  1 IC50
  Tab Delimited (TSV)   2D SDfile   Computed 3D by Vconf -m prep SDfile
Find this compound or compounds like it in BindingDB:
Activity Spreadsheet -- Enzyme Inhibition Constant Data from BindingDB
Found 1 hit for monomerid = 50042023
TargetIntegrase(Human immunodeficiency virus 1)
Bristol-Myers Squibb Research And Development
Curated by ChEMBL
LigandPNGBDBM50042023(CHEMBL3360129)
Affinity DataIC50:  8nM. Assay description: Inhibition of HIV-1 integrase strand transfer activity
In DepthDetails ArticlePubMed