BDBM50042027 CHEMBL3360133
SMILES Cc1ncnn1-c1cc(F)ccc1CNC(=O)c1nc(C2CCOCC2)n(C)c(=O)c1O
InChI Key InChIKey=WXPMGIBOQDTYOC-UHFFFAOYSA-N
Data  1 IC50
  Tab Delimited (TSV)   2D SDfile   Computed 3D by Vconf -m prep SDfile
Find this compound or compounds like it in BindingDB:
Activity Spreadsheet -- Enzyme Inhibition Constant Data from BindingDB
Found 1 hit for monomerid = 50042027
TargetIntegrase(Human immunodeficiency virus 1)
Bristol-Myers Squibb Research And Development
Curated by ChEMBL
LigandPNGBDBM50042027(CHEMBL3360133)
Affinity DataIC50:  8nM. Assay description: Inhibition of HIV-1 integrase strand transfer activity
In DepthDetails ArticlePubMed