BDBM50042168 3-{6-(3-Amino-phenylsulfanylmethyl)-3-[8-(4-methoxy-phenyl)-octyloxy]-pyridin-2-yl}-acrylic acid::CHEMBL112808
SMILES COc1ccc(CCCCCCCCOc2ccc(CSc3cccc(N)c3)nc2\C=C\C(O)=O)cc1
InChI Key InChIKey=LRFDSVGTKWZFOF-HTXNQAPBSA-N
Data  1 KI
  Tab Delimited (TSV)   2D SDfile   Computed 3D by Vconf -m prep SDfile
Find this compound or compounds like it in BindingDB:
Activity Spreadsheet -- Enzyme Inhibition Constant Data from BindingDB
Found 1 hit for monomerid = 50042168
TargetLeukotriene B4 receptor 1(Homo sapiens (Human))
Smithkline Beecham Pharmaceuticals
Curated by ChEMBL
LigandPNGBDBM50042168(3-{6-(3-Amino-phenylsulfanylmethyl)-3-[8-(4-methox...)
Affinity DataKi:  34nM. Assay description: Binding affinity of [3H]-LTB4 to receptors on intact human polymorphonuclear leukocytes
In DepthDetails ArticlePubMed