BDBM50042175 3-{6-(3-Amino-benzenesulfinylmethyl)-3-[8-(4-fluoro-phenyl)-octyloxy]-pyridin-2-yl}-acrylic acid::CHEMBL326909
SMILES Nc1cccc(c1)S(=O)Cc1ccc(OCCCCCCCCc2ccc(F)cc2)c(C=CC(O)=O)n1
InChI Key InChIKey=LCWVJORRLCOLKR-UHFFFAOYSA-N
Data  1 KI
  Tab Delimited (TSV)   2D SDfile   Computed 3D by Vconf -m prep SDfile
Find this compound or compounds like it in BindingDB:
Activity Spreadsheet -- Enzyme Inhibition Constant Data from BindingDB
Found 1 hit for monomerid = 50042175
TargetLeukotriene B4 receptor 1(Homo sapiens (Human))
Smithkline Beecham Pharmaceuticals
Curated by ChEMBL
LigandPNGBDBM50042175(3-{6-(3-Amino-benzenesulfinylmethyl)-3-[8-(4-fluor...)
Affinity DataKi:  12nM. Assay description: Binding affinity of [3H]-LTB4 to receptors on intact human polymorphonuclear leukocytes
In DepthDetails ArticlePubMed