BDBM50042257 4'-(2-Butyl-4-oxo-1,3,8-triaza-spiro[4.5]dec-1-en-3-ylmethyl)-biphenyl-2-carboxylic acid::CHEMBL114771
SMILES CCCCC1=NC2(CCNCC2)C(=O)N1Cc1ccc(cc1)-c1ccccc1C(O)=O
InChI Key InChIKey=SLNBALWSFAPJCN-UHFFFAOYSA-N
Data  1 IC50
  Tab Delimited (TSV)   2D SDfile   Computed 3D by Vconf -m prep SDfile
Find this compound or compounds like it in BindingDB:
Activity Spreadsheet -- Enzyme Inhibition Constant Data from BindingDB
Found 1 hit for monomerid = 50042257
TargetType-1 angiotensin II receptor B(RAT)
Sanofi Recherche
Curated by ChEMBL
LigandPNGBDBM50042257(4'-(2-Butyl-4-oxo-1,3,8-triaza-spiro[4.5]dec-1-en-...)
Affinity DataIC50:  890nM. Assay description: Binding affinity for Angiotensin II receptor, type 1 measured by ability to displace [125I]- A II from its specific binding site in rat liver membran...
In DepthDetails ArticlePubMed