BDBM50042483 CHEMBL119996::R-8-Methyl-3-phenyl-8-aza-bicyclo[3.2.1]octane-2-carboxylic acid methyl ester
SMILES COC(=O)C1C2CCC(C[C@H]1c1ccccc1)N2C
InChI Key InChIKey=OMBOXYLBBHNWHL-IBLUKRHDSA-N
Data  1 IC50
  Tab Delimited (TSV)   2D SDfile   Computed 3D by Vconf -m prep SDfile
Find this compound or compounds like it in BindingDB:
Activity Spreadsheet -- Enzyme Inhibition Constant Data from BindingDB
Found 1 hit for monomerid = 50042483
TargetSodium-dependent dopamine transporter(Rattus norvegicus (rat))
University Of Michigan
Curated by ChEMBL
LigandPNGBDBM50042483(CHEMBL119996 | R-8-Methyl-3-phenyl-8-aza-bicyclo[3...)
Affinity DataIC50:  23nM. Assay description: Inhibition of [3H]WIN-35428 binding to dopamine transporter in rat striatal membranes.
In DepthDetails ArticlePubMed