BDBM50043039 2-Diphenylacetyl-5-(4-methoxy-3-methyl-benzyl)-1,2,3,4-tetrahydro-isoquinoline-3-carboxylic acid::CHEMBL338709
SMILES COc1ccc(Cc2cccc3CN(C(Cc23)C(O)=O)C(=O)C(c2ccccc2)c2ccccc2)cc1C
InChI Key InChIKey=GREKMFQWMSIASG-UHFFFAOYSA-N
Data  2 IC50
  Tab Delimited (TSV)   2D SDfile   Computed 3D by Vconf -m prep SDfile
Find this compound or compounds like it in BindingDB:
Activity Spreadsheet -- Enzyme Inhibition Constant Data from BindingDB
Found 2 hits for monomerid = 50043039
TargetType-1 angiotensin II receptor A/B(RAT)
Dupont Pharmaceuticals
Curated by ChEMBL
LigandPNGBDBM50043039(2-Diphenylacetyl-5-(4-methoxy-3-methyl-benzyl)-1,2...)
Affinity DataIC50:  5.00E+3nM. Assay description: Binding affinity towards Angiotensin II receptor, type 1 in rat isolated adrenal cortical microsomes
In DepthDetails ArticlePubMed
TargetType-2 angiotensin II receptor(RAT)
Dupont Pharmaceuticals
Curated by ChEMBL
LigandPNGBDBM50043039(2-Diphenylacetyl-5-(4-methoxy-3-methyl-benzyl)-1,2...)
Affinity DataIC50:  100nM. Assay description: Binding affinity towards Angiotensin II receptor, type 2 in rat isolated adrenal medullary microsomes
In DepthDetails ArticlePubMed