BDBM50043395 2-({4-[(2,4-Diamino-5-methyl-pyrido[2,3-d]pyrimidin-6-ylmethyl)-methyl-amino]-naphthalene-1-carbonyl}-amino)-pentanedioic acid::CHEMBL337051
SMILES CN(Cc1cnc2nc(N)nc(N)c2c1C)c1ccc(C(=O)NC(CCC(O)=O)C(O)=O)c2ccccc12
InChI Key InChIKey=FUEOTVYXJAUQJI-UHFFFAOYSA-N
Data  1 KI
  Tab Delimited (TSV)   2D SDfile   Computed 3D by Vconf -m prep SDfile
Find this compound or compounds like it in BindingDB:
Activity Spreadsheet -- Enzyme Inhibition Constant Data from BindingDB
Found 1 hit for monomerid = 50043395
TargetDihydrofolate reductase(Mus musculus (Mouse))
Southern Research Institute
Curated by ChEMBL
LigandPNGBDBM50043395(2-({4-[(2,4-Diamino-5-methyl-pyrido[2,3-d]pyrimidi...)
Affinity DataKi:  0.00484nM. Assay description: Inhibitory activity of Dihydrofolate reductase in L1210 cells
In DepthDetails ArticlePubMed