BDBM50043601 1N-phenyl-7-amino-2-[1-[1-amino-(1R)-ethylcarboxamido]-3-phenyl-(1S)-propylcarboxamido]-(2S)-heptanamide::CHEMBL135640
SMILES C[C@@H](N)C(=O)N[C@@H](CCc1ccccc1)C(=O)N[C@@H](CCCCCN)C(=O)Nc1ccccc1
InChI Key InChIKey=YLFRNDPMRQUKDD-OIBXWCBGSA-N
Data  2 KI
  Tab Delimited (TSV)   2D SDfile   Computed 3D by Vconf -m prep SDfile
Find this compound or compounds like it in BindingDB:
Activity Spreadsheet -- Enzyme Inhibition Constant Data from BindingDB
Found 2 hits for monomerid = 50043601
TargetInterstitial collagenase(Homo sapiens (Human))
Merck Research Laboratories
Curated by ChEMBL
LigandPNGBDBM50043601(1N-phenyl-7-amino-2-[1-[1-amino-(1R)-ethylcarboxam...)
Affinity DataKi:  510nM. Assay description: Inhibition of human fibroblast collagenase
In DepthDetails ArticlePubMed
TargetStromelysin-1(Homo sapiens (Human))
Merck Research Laboratories
Curated by ChEMBL
LigandPNGBDBM50043601(1N-phenyl-7-amino-2-[1-[1-amino-(1R)-ethylcarboxam...)
Affinity DataKi:  1.60E+3nM. Assay description: Inhibition of human fibroblast stromelysin
In DepthDetails ArticlePubMed