BDBM50044019 (2S,3R)-3-(4-Amino-imidazo[4,5-c]pyridin-1-yl)-nonan-2-ol::CHEMBL433164
SMILES CCCCCC[C@H]([C@H](C)O)n1cnc2c(N)nccc12
InChI Key InChIKey=DAWSASDELFSMFB-NWDGAFQWSA-N
Data  1 KI
  Tab Delimited (TSV)   2D SDfile   Computed 3D by Vconf -m prep SDfile
Find this compound or compounds like it in BindingDB:
Activity Spreadsheet -- Enzyme Inhibition Constant Data from BindingDB
Found 1 hit for monomerid = 50044019
TargetAdenosine deaminase(Bos taurus (bovine))
University Of Rhode Island
Curated by ChEMBL
LigandPNGBDBM50044019((2S,3R)-3-(4-Amino-imidazo[4,5-c]pyridin-1-yl)-non...)
Affinity DataKi:  6.20nM. Assay description: Compound was tested for the inhibition of adenosine deaminase from calf intestinal mucosa
In DepthDetails ArticlePubMed