BDBM50044754 CHEMBL3353955
SMILES [H][C@]1(NC(=O)[C@H](Cc2ccc(O)cc2)NC(=O)CCSSC[C@H](NC(=O)[C@H](CC(N)=O)NC(=O)[C@H](CCC(N)=O)NC1=O)C(=O)N(CCc1ccncc1)CC(=O)N[C@@H](CC(C)C)C(=O)NCC(N)=O)[C@@H](C)CC
InChI Key InChIKey=DJUWRCYKBXNLDA-SJMOYVGOSA-N
Data  1 IC50  4 EC50
  Tab Delimited (TSV)   2D SDfile   Computed 3D by Vconf -m prep SDfile
Find this compound or compounds like it in BindingDB:
Activity Spreadsheet -- Enzyme Inhibition Constant Data from BindingDB
Found 5 hits for monomerid = 50044754
TargetOxytocin receptor(Homo sapiens (Human))
Ferring Research Institute
Curated by ChEMBL
LigandPNGBDBM50044754(CHEMBL3353955)
Affinity DataEC50:  0.0200nM. Assay description: Agonist activity at human oxytocin receptor expressed in CHO-K1 cells after 5 hrs by firefly luciferase reporter gene assay
In DepthDetails ArticlePubMed
TargetVasopressin V2 receptor(Homo sapiens (Human))
Ferring Research Institute
Curated by ChEMBL
LigandPNGBDBM50044754(CHEMBL3353955)
Affinity DataEC50:  47nM. Assay description: Agonist activity at human vasopressin V2 expressed in HEK293 cells after 5 hrs by firefly luciferase reporter gene assay
In DepthDetails ArticlePubMed
TargetVasopressin V1b receptor(Homo sapiens (Human))
Ferring Research Institute
Curated by ChEMBL
LigandPNGBDBM50044754(CHEMBL3353955)
Affinity DataEC50:  720nM. Assay description: Agonist activity at human vasopressin V1b expressed in HEK293 cells after 5 hrs by firefly luciferase reporter gene assay
In DepthDetails ArticlePubMed
TargetVasopressin V1a receptor(Homo sapiens (Human))
Ferring Research Institute
Curated by ChEMBL
LigandPNGBDBM50044754(CHEMBL3353955)
Affinity DataEC50: >1.00E+4nM. Assay description: Agonist activity at human vasopressin V1a expressed in HEK293 cells after 5 hrs by firefly luciferase reporter gene assay
In DepthDetails ArticlePubMed
TargetVasopressin V1a receptor(Homo sapiens (Human))
Ferring Research Institute
Curated by ChEMBL
LigandPNGBDBM50044754(CHEMBL3353955)
Affinity DataIC50:  350nM. Assay description: Antagonist activity at human vasopressin V1a expressed in AVP-stimulated HEK293 cells after 5 hrs by firefly luciferase reporter gene assay
In DepthDetails ArticlePubMed