BDBM50045337 8-Bromo-3-isobutyl-1-methyl-3,7-dihydro-purine-2,6-dione::CHEMBL314959
SMILES CC(C)Cn1c2nc(Br)[nH]c2c(=O)n(C)c1=O
InChI Key InChIKey=JCAIYNMCEMWPAD-UHFFFAOYSA-N
Data  1 KI
  Tab Delimited (TSV)   2D SDfile   Computed 3D by Vconf -m prep SDfile
Find this compound or compounds like it in BindingDB:
Activity Spreadsheet -- Enzyme Inhibition Constant Data from BindingDB
Found 1 hit for monomerid = 50045337
TargetAdenosine receptor A1(Rattus norvegicus (rat))
National Institutes Of Health
Curated by ChEMBL
LigandPNGBDBM50045337(8-Bromo-3-isobutyl-1-methyl-3,7-dihydro-purine-2,6...)
Affinity DataKi:  6.50E+4nM. Assay description: Binding affinity for adenosine A1 receptor from rat brain membranes using [3H]-PIA as radioligand
In DepthDetails ArticlePubMed