BDBM50045355 8-Cyclobutyl-1,3-dimethyl-3,7-dihydro-purine-2,6-dione::CHEMBL85185
SMILES Cn1c2nc([nH]c2c(=O)n(C)c1=O)C1CCC1
InChI Key InChIKey=OBURDMXZDVFAKK-UHFFFAOYSA-N
Data  2 KI
  Tab Delimited (TSV)   2D SDfile   Computed 3D by Vconf -m prep SDfile
Find this compound or compounds like it in BindingDB:
Activity Spreadsheet -- Enzyme Inhibition Constant Data from BindingDB
Found 2 hits for monomerid = 50045355
TargetAdenosine receptor A1(Rattus norvegicus (rat))
National Institutes Of Health
Curated by ChEMBL
LigandPNGBDBM50045355(8-Cyclobutyl-1,3-dimethyl-3,7-dihydro-purine-2,6-d...)
Affinity DataKi:  190nM. Assay description: Binding affinity for adenosine A1 receptor from rat brain membranes using [3H]-PIA as radioligand
In DepthDetails ArticlePubMed
TargetAdenosine receptor A2a(Rattus norvegicus (rat))
National Institutes Of Health
Curated by ChEMBL
LigandPNGBDBM50045355(8-Cyclobutyl-1,3-dimethyl-3,7-dihydro-purine-2,6-d...)
Affinity DataKi:  2.80E+3nM. Assay description: Binding affinity for adenosine A2A receptor from rat brain membranes using [3H]-CGS-21,680
In DepthDetails ArticlePubMed