BDBM50045365 CHEMBL3337496
SMILES CC[C@H](C)[C@H](NC(=O)[C@H](C)NC(=O)[C@H](CCCNC(N)=N)NC(=O)[C@@H](NC(=O)[C@H](C)NC(=O)[C@H](Cc1cnc[nH]1)NC(=O)CNC(=O)[C@@H](NC(=O)[C@H](CCCCN)NC(=O)[C@H](CCC(N)=O)NC(=O)[C@H](Cc1c[nH]c2ccccc12)NC(=O)[C@H](CCCCN)NC(=O)[C@H](CCCNC(N)=N)NC(=O)[C@H](CCCNC(N)=N)NC(=O)[C@H](C)NC(=O)[C@H](CO)NC(=O)CN)[C@@H](C)O)C(C)C)C(=O)NCC(=O)N[C@@H](CCCNC(N)=N)C(=O)N[C@@H](CC(C)C)C(=O)N[C@@H](CO)C(O)=O
InChI Key InChIKey=KHGGUUUTILCFMP-REYRWYPOSA-N
Data  1 Kd
  Tab Delimited (TSV)   2D SDfile   Computed 3D by Vconf -m prep SDfile
Find this compound or compounds like it in BindingDB:
Activity Spreadsheet -- Enzyme Inhibition Constant Data from BindingDB
Found 1 hit for monomerid = 50045365
TargetCalmodulin(Bos taurus)
Janssen Research And Development
Curated by ChEMBL
LigandPNGBDBM50045365(CHEMBL3337496)
Affinity DataKd:  1nM. Assay description: Binding affinity to calmodulin (unknown origin) by NMR analysis
In DepthDetails ArticlePubMed