BDBM50045520 CHEMBL3314211
SMILES CNC(=N)NCCC[C@H](NC(=O)[C@H](CC(C)C)NC(=O)NNC(=O)[C@H](Cc1ccccc1)NC(=O)[C@@H](NC(=O)[C@H](CC(N)=O)NC(=O)[C@@H](Cc1ccncc1)NC(=O)[C@H](N)Cc1ccc(O)cc1)C(C)(C)C)C(=O)N[C@@H](Cc1c[nH]c2ccccc12)C(N)=O
InChI Key
Data  2 EC50
  Tab Delimited (TSV)   2D SDfile   Computed 3D by Vconf -m prep SDfile
Find this compound or compounds like it in BindingDB:
Activity Spreadsheet -- Enzyme Inhibition Constant Data from BindingDB
Found 2 hits for monomerid = 50045520
TargetKiSS-1 receptor(Rattus norvegicus)
Takeda Pharmaceutical
Curated by ChEMBL
LigandPNGBDBM50045520(CHEMBL3314211)
Affinity DataEC50:  22nM. Assay description: Agonist activity at rat KISS1R transfected in CHO cells assessed as intracellular calcium flux after 24 hrs by functional FLIPR assay
In DepthDetails ArticlePubMed
TargetKiSS-1 receptor(Homo sapiens (Human))
Takeda Pharmaceutical
Curated by ChEMBL
LigandPNGBDBM50045520(CHEMBL3314211)
Affinity DataEC50:  1.5nM. Assay description: Agonist activity at human KISS1R transfected in CHO cells assessed as intracellular calcium flux after 24 hrs by functional FLIPR assay
In DepthDetails ArticlePubMed