BDBM50045595 CHEMBL3311505
SMILES COc1ccc(Cl)cc1CNc1ncnc2n(cnc12)[C@@H]1OC[C@](O)(CO)[C@H]1O
InChI Key InChIKey=TYIIHTIQHWAIAM-BMGDILEWSA-N
Data  1 KI
  Tab Delimited (TSV)   2D SDfile   Computed 3D by Vconf -m prep SDfile
Find this compound or compounds like it in BindingDB:
Activity Spreadsheet -- Enzyme Inhibition Constant Data from BindingDB
Found 1 hit for monomerid = 50045595
TargetAdenosine receptor A3(Homo sapiens (Human))
Ghent University
Curated by ChEMBL
LigandPNGBDBM50045595(CHEMBL3311505)
Affinity DataKi:  978nM. Assay description: Displacement of [125I]N6-(4-amino-3-iodobenzyl)adenosine-50-N-methyluronamide from human recombinant A3AR expressed in CHO cells
In DepthDetails ArticlePubMed