BDBM50045596 CHEMBL3311508
SMILES COc1ccc(Cl)cc1CNc1ncnc2n(cnc12)[C@@H]1OC[C@@](O)(CO)[C@H]1O
InChI Key InChIKey=TYIIHTIQHWAIAM-QGTPRVQTSA-N
Data  1 KI  1 IC50
  Tab Delimited (TSV)   2D SDfile   Computed 3D by Vconf -m prep SDfile
Find this compound or compounds like it in BindingDB:
Activity Spreadsheet -- Enzyme Inhibition Constant Data from BindingDB
Found 2 hits for monomerid = 50045596
TargetAdenosine receptor A3(Homo sapiens (Human))
Ghent University
Curated by ChEMBL
LigandPNGBDBM50045596(CHEMBL3311508)
Affinity DataKi:  3.07E+3nM. Assay description: Displacement of [125I]N6-(4-amino-3-iodobenzyl)adenosine-50-N-methyluronamide from human recombinant A3AR expressed in CHO cells
In DepthDetails ArticlePubMed
TargetAdenosine receptor A3(Homo sapiens (Human))
Ghent University
Curated by ChEMBL
LigandPNGBDBM50045596(CHEMBL3311508)
Affinity DataIC50:  1.56E+3nM. Assay description: Agonist activity at human recombinant A3AR expressed in CHO cells assessed as inhibition of forskolin-induced stimulation of cAMP production
In DepthDetails ArticlePubMed