BDBM50045765 3-(1-Allyl-3,4-dimethyl-piperidin-4-yl)-phenol::CHEMBL94515
SMILES C[C@H]1CN(CC=C)CC[C@@]1(C)c1cccc(O)c1
InChI Key InChIKey=HJLHIMASSVYSEF-XJKSGUPXSA-N
Data  2 KI
  Tab Delimited (TSV)   2D SDfile   Computed 3D by Vconf -m prep SDfile
Find this compound or compounds like it in BindingDB:
Activity Spreadsheet -- Enzyme Inhibition Constant Data from BindingDB
Found 2 hits for monomerid = 50045765
TargetMu-type opioid receptor(Rattus norvegicus (rat))
Eli Lilly
Curated by ChEMBL
LigandPNGBDBM50045765(3-(1-Allyl-3,4-dimethyl-piperidin-4-yl)-phenol | C...)
Affinity DataKi:  16nM. Assay description: Binding affinity towards mu opioid receptor by displacement of [3H]-NAL from rat brain homogenates
In DepthDetails ArticlePubMed
TargetKappa-type opioid receptor(Cavia porcellus (domestic guinea pig))
Eli Lilly
Curated by ChEMBL
LigandPNGBDBM50045765(3-(1-Allyl-3,4-dimethyl-piperidin-4-yl)-phenol | C...)
Affinity DataKi:  313nM. Assay description: Binding affinity towards kappa-opioid receptor by displacement of [3H]-EKC at from guinea pig cortical tissue
In DepthDetails ArticlePubMed