BDBM50045992 Benzyl-(3-{4-[cyano-(2-methyl-pyridin-3-yl)-methyl]-piperazin-1-yl}-3-oxo-1-phenyl-propyl)-carbamic acid methyl ester::CHEMBL103171
SMILES COC(=O)N(Cc1ccccc1)C(CC(=O)N1CCN(CC1)C(C#N)c1cccnc1C)c1ccccc1
InChI Key InChIKey=UDXSGFBYAPASTK-UHFFFAOYSA-N
Data  1 IC50
  Tab Delimited (TSV)   2D SDfile   Computed 3D by Vconf -m prep SDfile
Find this compound or compounds like it in BindingDB:
Activity Spreadsheet -- Enzyme Inhibition Constant Data from BindingDB
Found 1 hit for monomerid = 50045992
TargetPlatelet-activating factor receptor(Cavia porcellus)
J. Uriach & CíA.
Curated by ChEMBL
LigandPNGBDBM50045992(Benzyl-(3-{4-[cyano-(2-methyl-pyridin-3-yl)-methyl...)
Affinity DataIC50:  68nM. Assay description: Inhibition of PAF-induced platelet aggregation
In DepthDetails ArticlePubMed