BDBM50046005 CHEMBL100853::[4-(3-Amino-3-phenyl-propionyl)-piperazin-1-yl]-(2-methyl-pyridin-3-yl)-acetonitrile
SMILES Cc1ncccc1C(C#N)N1CCN(CC1)C(=O)CC(N)c1ccccc1
InChI Key InChIKey=HEHIASJYLABZLO-UHFFFAOYSA-N
Data  1 IC50
  Tab Delimited (TSV)   2D SDfile   Computed 3D by Vconf -m prep SDfile
Find this compound or compounds like it in BindingDB:
Activity Spreadsheet -- Enzyme Inhibition Constant Data from BindingDB
Found 1 hit for monomerid = 50046005
TargetPlatelet-activating factor receptor(Cavia porcellus)
J. Uriach & CíA.
Curated by ChEMBL
LigandPNGBDBM50046005(CHEMBL100853 | [4-(3-Amino-3-phenyl-propionyl)-pip...)
Affinity DataIC50:  740nM. Assay description: Inhibition of PAF-induced platelet aggregation
In DepthDetails ArticlePubMed