BDBM50046021 CHEMBL103560::[4-(3-Fluoro-2,2-dimethyl-3,3-diphenyl-propionyl)-piperazin-1-yl]-(2-methyl-pyridin-3-yl)-acetonitrile
SMILES Cc1ncccc1C(C#N)N1CCN(CC1)C(=O)C(C)(C)C(F)(c1ccccc1)c1ccccc1
InChI Key InChIKey=LQRMBTMBFJSWNP-UHFFFAOYSA-N
Data  1 IC50
  Tab Delimited (TSV)   2D SDfile   Computed 3D by Vconf -m prep SDfile
Find this compound or compounds like it in BindingDB:
Activity Spreadsheet -- Enzyme Inhibition Constant Data from BindingDB
Found 1 hit for monomerid = 50046021
TargetPlatelet-activating factor receptor(Cavia porcellus)
J. Uriach & CíA.
Curated by ChEMBL
LigandPNGBDBM50046021(CHEMBL103560 | [4-(3-Fluoro-2,2-dimethyl-3,3-diphe...)
Affinity DataIC50:  26nM. Assay description: Inhibition of PAF-induced platelet aggregation
In DepthDetails ArticlePubMed