BDBM50046134 2-[2-(Cyclohexyloxy-hydroxy-phosphorylamino)-4-methyl-pentanoylamino]-3-(1H-indol-3-yl)-propionic acid
SMILES CC(C)C[C@H](NP([O-])(=O)OC1CCCCC1)C(=O)N[C@@H](Cc1c[nH]c2ccccc12)C(O)=O
InChI Key InChIKey=PPBZUKXLZSIOCG-SFTDATJTSA-M
Data  1 IC50
  Tab Delimited (TSV)   2D SDfile   Computed 3D by Vconf -m prep SDfile
Find this compound or compounds like it in BindingDB:
Activity Spreadsheet -- Enzyme Inhibition Constant Data from BindingDB
Found 1 hit for monomerid = 50046134
TargetEndothelin-converting enzyme 1(Homo sapiens (Human))
Monsanto
Curated by ChEMBL
LigandPNGBDBM50046134(2-[2-(Cyclohexyloxy-hydroxy-phosphorylamino)-4-met...)
Affinity DataIC50:  4.80E+4nM. Assay description: Inhibition of endothelin converting enzyme in an RIA assay using ET-1 as substrate
In DepthDetails ArticlePubMed