BDBM50046790 2-Benzyl-N-[1-(1-cyclohexylmethyl-2,3-dihydroxy-5-methyl-hexylcarbamoyl)-2-(methoxy-methyl-amino)-ethyl]-4-morpholin-4-yl-4-oxo-butyramide::CHEMBL141687
SMILES CON(C)C[C@H](NC(=O)[C@@H](CC(=O)N1CCOCC1)Cc1ccccc1)C(=O)N[C@@H](CC1CCCCC1)[C@@H](O)[C@@H](O)CC(C)C
InChI Key InChIKey=MOPQPXUIKAEKHY-MCLUNMOSSA-N
Data  1 IC50
  Tab Delimited (TSV)   2D SDfile   Computed 3D by Vconf -m prep SDfile
Find this compound or compounds like it in BindingDB:
Activity Spreadsheet -- Enzyme Inhibition Constant Data from BindingDB
Found 1 hit for monomerid = 50046790
TargetRenin(Homo sapiens (Human))
Abbott Laboratories
Curated by ChEMBL
LigandPNGBDBM50046790(2-Benzyl-N-[1-(1-cyclohexylmethyl-2,3-dihydroxy-5-...)
Affinity DataIC50:  88nMpH: 7.4Assay Description:Inhibition of human plasma renin at pH 7.4
In DepthDetails ArticlePubMed