BDBM50046936 CHEMBL355806::N-(4-{1-[(1H-Benzoimidazol-2-ylmethyl)-carbamoyl]-2-methyl-butylcarbamoyl}-1-cyclohexylmethyl-2,3-dihydroxy-5-methyl-hexyl)-2-[2-(2-methoxy-ethoxy)-ethoxy]-benzamide
SMILES COCCOCCOc1cccnc1C(=O)N[C@@H](CC1CCCCC1)[C@@H](O)[C@H](O)[C@@H](C(C)C)C(=O)N[C@@H]1C(O)Cc2ccccc12
InChI Key InChIKey=ZXPXIAMIVLAUJR-YOYLUUFLSA-N
Data  1 KI
  Tab Delimited (TSV)   2D SDfile   Computed 3D by Vconf -m prep SDfile
Find this compound or compounds like it in BindingDB:
Activity Spreadsheet -- Enzyme Inhibition Constant Data from BindingDB
Found 1 hit for monomerid = 50046936
TargetGag-Pol polyprotein [489-587](Human immunodeficiency virus type 1)
Upjohn Laboratories
Curated by ChEMBL
LigandPNGBDBM50046936(CHEMBL355806 | N-(4-{1-[(1H-Benzoimidazol-2-ylmeth...)
Affinity DataKi: >200nM. Assay description: Inhibition of HIV-1 protease in vitro.
In DepthDetails ArticlePubMed