BDBM50047732 (5-Dimethylaminomethyl-furan-2-ylmethyl)-[2-(2-nitromethylene-imidazolidin-1-yl)-ethyl]-amine::CHEMBL347729
SMILES CN(C)Cc1ccc(CNCCN2CCN=C2C[N+]([O-])=O)o1
InChI Key InChIKey=KFALQMGXUTWRGV-UHFFFAOYSA-N
Data  1 IC50
  Tab Delimited (TSV)   2D SDfile   Computed 3D by Vconf -m prep SDfile
Find this compound or compounds like it in BindingDB:
Activity Spreadsheet -- Enzyme Inhibition Constant Data from BindingDB
Found 1 hit for monomerid = 50047732
TargetAcetylcholinesterase(Homo sapiens (Human))
Kyowa Hakko Kogyo
Curated by ChEMBL
LigandPNGBDBM50047732((5-Dimethylaminomethyl-furan-2-ylmethyl)-[2-(2-nit...)
Affinity DataIC50: >2.00E+3nM. Assay description: Inhibition of guinea pig acetylcholinesterase
In DepthDetails ArticlePubMed