BDBM50047994 CHEMBL3314891
SMILES CCCCC(CC)CNc1ncc(C(=O)OCC)c2nc(nn12)-c1ccco1
InChI Key InChIKey=UWLYAOJAQQPBDW-UHFFFAOYSA-N
Data  4 KI
  Tab Delimited (TSV)   2D SDfile   Computed 3D by Vconf -m prep SDfile
Find this compound or compounds like it in BindingDB:
Activity Spreadsheet -- Enzyme Inhibition Constant Data from BindingDB
Found 4 hits for monomerid = 50047994
TargetAdenosine receptor A3(Homo sapiens (Human))
Universit£
Curated by ChEMBL
LigandPNGBDBM50047994(CHEMBL3314891)
Affinity DataKi:  39nM. Assay description: Displacement of [3H]NECA from human adenosine A3 receptor expressed in CHO cells
In DepthDetails ArticlePubMed
TargetAdenosine receptor A2a(Homo sapiens (Human))
Universit£
Curated by ChEMBL
LigandPNGBDBM50047994(CHEMBL3314891)
Affinity DataKi:  215nM. Assay description: Displacement of [3H]NECA from human adenosine A2A receptor expressed in CHO cells
In DepthDetails ArticlePubMed
TargetAdenosine receptor A1(Homo sapiens (Human))
Universit£
Curated by ChEMBL
LigandPNGBDBM50047994(CHEMBL3314891)
Affinity DataKi:  1.15E+3nM. Assay description: Displacement of [3H]CCPA from human adenosine A1 receptor expressed in CHO cells
In DepthDetails ArticlePubMed
TargetAdenosine receptor A2b(Homo sapiens (Human))
Universit£
Curated by ChEMBL
LigandPNGBDBM50047994(CHEMBL3314891)
Affinity DataKi: >1.00E+4nM. Assay description: Antagonist activity at human adenosine A2B receptor expressed in CHO cells assessed as inhibition of NECA-stimulated adenylyl cyclase activity
In DepthDetails ArticlePubMed