BDBM50048087 CHEMBL3311516
SMILES COc1ccc(CCCC[C@@H]2N[C@@H](CO)[C@H](O)[C@H]2O)cc1
InChI Key InChIKey=LSLFNXACKCUPBW-VGWMRTNUSA-N
Data  3 IC50
  Tab Delimited (TSV)   2D SDfile   Computed 3D by Vconf -m prep SDfile
Find this compound or compounds like it in BindingDB:
Activity Spreadsheet -- Enzyme Inhibition Constant Data from BindingDB
Found 3 hits for monomerid = 50048087
TargetLysosomal alpha-glucosidase(Rattus norvegicus)
Tohoku Pharmaceutical University
Curated by ChEMBL
LigandPNGBDBM50048087(CHEMBL3311516)
Affinity DataIC50:  110nM. Assay description: Inhibition of Wistar rat intestinal maltase assessed as inhibition of D-glucose release after 30 mins by spectrophotometry
In DepthDetails ArticlePubMed
TargetSucrase-isomaltase, intestinal(Rattus norvegicus (Rat))
Tohoku Pharmaceutical University
Curated by ChEMBL
LigandPNGBDBM50048087(CHEMBL3311516)
Affinity DataIC50:  130nM. Assay description: Inhibition of Wistar rat intestinal sucrase assessed as inhibition of D-glucose release after 30 mins by spectrophotometry
In DepthDetails ArticlePubMed
TargetSucrase-isomaltase, intestinal(Rattus norvegicus (Rat))
Tohoku Pharmaceutical University
Curated by ChEMBL
LigandPNGBDBM50048087(CHEMBL3311516)
Affinity DataIC50:  1.80E+3nM. Assay description: Inhibition of Wistar rat intestinal isomaltase assessed as inhibition of D-glucose release after 30 mins by spectrophotometry
In DepthDetails ArticlePubMed