BDBM50048234 1-Phenyl-4-(1-phenyl-1H-pyrrol-3-ylmethyl)-piperazine::CHEMBL343657
SMILES C(N1CCN(CC1)c1ccccc1)c1ccn(c1)-c1ccccc1
InChI Key InChIKey=NJUJKEDBUFPIDQ-UHFFFAOYSA-N
Data  3 KI
  Tab Delimited (TSV)   2D SDfile   Computed 3D by Vconf -m prep SDfile
Find this compound or compounds like it in BindingDB:
Activity Spreadsheet -- Enzyme Inhibition Constant Data from BindingDB
Found 3 hits for monomerid = 50048234
TargetD(4) dopamine receptor(Homo sapiens (Human))
Neurogen
Curated by ChEMBL
LigandPNGBDBM50048234(1-Phenyl-4-(1-phenyl-1H-pyrrol-3-ylmethyl)-piperaz...)
Affinity DataKi:  4nM. Assay description: Displacement of [3H]-YM 09151 from human Dopamine receptor D4
In DepthDetails ArticlePubMed
TargetD(2) dopamine receptor(Cercopithecus aethiops)
Neurogen
Curated by ChEMBL
LigandPNGBDBM50048234(1-Phenyl-4-(1-phenyl-1H-pyrrol-3-ylmethyl)-piperaz...)
Affinity DataKi:  14nM. Assay description: Displacement of [3H]-YM 09151 from african green monkey Dopamine receptor D2
In DepthDetails ArticlePubMed
TargetD(3) dopamine receptor(Chlorocebus aethiops)
Neurogen
Curated by ChEMBL
LigandPNGBDBM50048234(1-Phenyl-4-(1-phenyl-1H-pyrrol-3-ylmethyl)-piperaz...)
Affinity DataKi:  49nM. Assay description: Displacement of [3H]-YM 09151 from african moonkey Dopamine receptor D3
In DepthDetails ArticlePubMed